calculation percent
type: DatatypeProperty
comment: added from BSP (per-class property assessment)
definition: The calculation percentage for this trade price.
domain includes: AllowanceCharge
range includes: decimal
term status: proposed