calculated rate
type: DatatypeProperty
comment: added from BSP (per-class property assessment)
definition: The rate used to calculate the amount of this trade related tax, levy or duty.
domain includes: TradeTax
range includes: decimal
term status: proposed