bill start date time
type: DatatypeProperty
comment: added from BSP (per-class property assessment)
definition: The date, time, date time, or other date time value of the bill start specified by these trade payment terms.
domain includes: PaymentTerms
range includes: dateTime
term status: proposed