basis date time
type: DatatypeProperty
comment: added from BSP (per-class property assessment)
definition: The date, time, date time, or other date time value used as the basis for this trade price.
domain includes: TradePrice
range includes: dateTime
term status: proposed