availability indicator
type: DatatypeProperty
comment: added from BSP (per-class property assessment)
domain includes: SupplyChainInventory
range includes: string
definition: The indication of whether or not this supply chain inventory is available.
term status: proposed