attached logistics transport equipment
type: ObjectProperty
comment: added from BSP (default-keep re-triage)
domain includes: TransportMeans
range includes: TransportEquipment
definition: A piece of logistics transport equipment attached to this logistics means of transport.
term status: proposed