attached asset id
type: ObjectProperty
comment: added from BSP (per-class property assessment)
domain includes: IOTDevice
range includes: Identifier
definition: The identifier for the asset, such as a container, to which this monitoring IOT device is attached.
term status: proposed