asset transfer status code
type: ObjectProperty
comment: added from BSP (per-class property assessment)
domain includes: SupplyChainInventory
range includes: any-code
definition: The code specifying an asset transfer status for this supply chain inventory.
term status: proposed