Buyer
type: Concept
definition: conformity assessment by potential purchaser
in scheme: Assessor Level
notation: buyer

Assessor Level
type: ConceptScheme
source: AssessorLevel
definition: Assessor Level UN/CEFACT code list.
code list scope: domain
term status: proposed

Membership
type: Concept
definition: conformity assessment by industry representative body or membership body
in scheme: Assessor Level
notation: membership

Self
type: Concept
definition: self-assessment
in scheme: Assessor Level
notation: self

Hybrid
type: Concept
definition: 2nd or 3rd party conformity assessment that is dependent on the accuracy of information provided by self-declaring parties
in scheme: Assessor Level
notation: hybrid

3rd Party
type: Concept
definition: 3rd party (independent) conformity assessment
in scheme: Assessor Level
notation: 3rdParty

Commercial
type: Concept
definition: conformity assessment by related body or under commercial contract
in scheme: Assessor Level
notation: commercial

Unspecified
type: Concept
definition: conformity assessment by party with unspecified relationship
in scheme: Assessor Level
notation: unspecified