Authority mandate
type: Concept
definition: Government mandate for conformity assessment activity. Ownership or mandate provided by national government or intergovernmental entity.
in scheme: assessment-level
notation: authority-mandate