Authority globalmra
type: Concept
definition: Accreditation of CAB under global mutual recognition arrangement by a body peer-evaluated to ISO/IEC 17011. Scheme evaluation is a prerequisite for accreditation of CABs by bodies that are signatories to the Global Accreditation Cooperation Incorporated Mutual Recognition Arrangement.
in scheme: assessment-level
notation: authority-globalmra