assessed facility
type: ObjectProperty
definition: A facility (with verification status) that is the subject of the assessment.
domain includes: Assessment
range includes: Facility
term status: proposed