applied treatment
type: DatatypeProperty
comment: added from BSP (per-class property assessment)
domain includes: ProductBatch
range includes: string
definition: A treatment, expressed as text, applied to this crop produce batch.
term status: proposed