applied tax
type: ObjectProperty
comment: added from BSP (per-class property assessment)
domain includes: ServiceCharge
range includes: TradeTax
definition: A tax that is applied to this logistics service charge.
term status: proposed