applied from location
type: ObjectProperty
comment: added from BSP (per-class property assessment)
domain includes: ServiceCharge
range includes: Location
definition: The start location from which this logistics service charge should be applied.
term status: proposed