applicable transport means
type: ObjectProperty
comment: added from BSP (default-keep re-triage)
domain includes: ConsignmentItem
range includes: TransportMeans
definition: The means of transport applicable to this supply chain consignment item.
term status: proposed