applicable material
type: ObjectProperty
comment: added from BSP (default-keep re-triage)
definition: Material applicable for this supply chain trade line item.
domain includes: Image
range includes: Material
term status: proposed