applicable forecast terms
type: ObjectProperty
comment: added from BSP (default-keep re-triage)
domain includes: TradeAgreement
range includes: ForecastTerms
definition: The supply chain forecast terms applicable to this header trade agreement.
term status: proposed