also known as
type: ObjectProperty
domain includes: Facility
domain includes: Party
range includes: Party
range includes: Facility
definition: Another record (party or facility) that denotes the same real-world entity.
term status: proposed