alliance name
type: DatatypeProperty
comment: restored from BSP (default-keep re-triage)
domain includes: Party
range includes: string
definition: An alliance name, expressed as text, for this trade party.
term status: proposed