alignment level
type: ObjectProperty
comment: code → scheme-alignment-level scheme. Qualifier on the alignment join node.
definition: The alignment level (exceeds, meets, partial).
range includes: scheme-alignment-level
term status: proposed