alignment level
type: ObjectProperty
comment: code → scheme-alignment-level scheme. Qualifier on the alignment join node.
range includes: scheme-alignment-level
definition: The alignment level (exceeds, meets, partial).
term status: proposed