additional hazard classification id
type: ObjectProperty
comment: added from BSP (per-class property assessment)
definition: The unique identifier of an additional hazard class applicable to these transported dangerous goods.
domain includes: DangerousGoods
range includes: dangerous-goods-class-code-list
term status: proposed