drawee
type: ObjectProperty
provenance: Proposed Vocab addition — not from BSP/UNTP; pending governance approval.
definition: The party on whom a bill of exchange is drawn (who must pay).
domain includes: Trade Settlement
range includes: Party
term status: proposed

due payable amount
type: ObjectProperty
definition: The total amount due and payable.
domain includes: Trade Settlement
range includes: MonetaryAmount
term status: proposed

guarantor
type: ObjectProperty
provenance: Proposed Vocab addition — not from BSP/UNTP; pending governance approval.
definition: The party guaranteeing payment or performance.
domain includes: Trade Settlement
range includes: Party
term status: proposed

has payment terms
type: ObjectProperty
definition: The payment terms applying to the settlement.
domain includes: Trade Settlement
range includes: PaymentTerms
term status: proposed

line total amount
type: ObjectProperty
comment: brought back from BSP; attached to existing class (BSP home dissolved/niche)
definition: A monetary value of the line amount total being reported in this trade settlement header monetary summation.
domain includes: Trade Settlement
range includes: MonetaryAmount
term status: proposed

payment reference
type: DatatypeProperty
definition: The payment reference for the settlement.
domain includes: Trade Settlement
range includes: string
term status: proposed

total invoice amount
type: ObjectProperty
comment: brought back from BSP (UNVTD grounding gap)
definition: A monetary value of the total invoice on which this header trade settlement is calculated.
domain includes: Trade Settlement
range includes: MonetaryAmount
term status: proposed

total prepaid amount
type: ObjectProperty
comment: brought back from BSP; attached to existing class (BSP home dissolved/niche)
definition: A monetary value of a prepaid total reported in this trade settlement header monetary summation.
domain includes: Trade Settlement
range includes: MonetaryAmount
term status: proposed

Trade Settlement
type: Class
definition: The financial settlement terms and totals of a trade agreement.
object nature: value
term status: proposed