Shipment Package
type: Class
definition: The packaging grouping trade items within a shipment.
object nature: value
term status: proposed

consolidates
type: ObjectProperty
domain includes: Shipment Package
range includes: TradeItem
definition: A trade item grouped within the shipment package.
term status: proposed