allowance charge
type: DatatypeProperty
comment: added from BSP (per-class property assessment)
definition: The allowance or charge, expressed as text, for this logistics service charge.
domain includes: Service Charge
range includes: string
term status: proposed

applied amount
type: ObjectProperty
comment: added from BSP (per-class property assessment)
definition: A monetary value applied to this logistics service charge.
domain includes: Service Charge
range includes: MonetaryAmount
term status: proposed

applied from location
type: ObjectProperty
comment: added from BSP (per-class property assessment)
definition: The start location from which this logistics service charge should be applied.
domain includes: Service Charge
range includes: Location
term status: proposed

applied tax
type: ObjectProperty
comment: added from BSP (per-class property assessment)
definition: A tax that is applied to this logistics service charge.
domain includes: Service Charge
range includes: TradeTax
term status: proposed

applied to location
type: ObjectProperty
comment: added from BSP (per-class property assessment)
definition: The end location at which this logistics service charge is no longer to be applied.
domain includes: Service Charge
range includes: Location
term status: proposed

calculation basis
type: DatatypeProperty
comment: added from BSP (per-class property assessment)
definition: The basis, expressed as text, on which this logistics service charge is to be calculated, such as by volume or per unit.
domain includes: Service Charge
range includes: string
term status: proposed

calculation basis commodity code
type: ObjectProperty
comment: added from BSP (per-class property assessment)
definition: The code specifying the commodity used as the basis for the calculation of this logistics service charge.
domain includes: Service Charge
range includes: hs-commodity
term status: proposed

calculation basis price
type: ObjectProperty
comment: added from BSP (per-class property assessment)
definition: The trade price upon which a calculation of this logistics service charge is or will be based.
domain includes: Service Charge
range includes: TradePrice
term status: proposed

charge category code
type: ObjectProperty
comment: added from BSP (per-class property assessment)
definition: The code specifying the category of charge for this logistics service charge.
domain includes: Service Charge
range includes: any-code
term status: proposed

charge currency code
type: ObjectProperty
comment: added from BSP (per-class property assessment)
definition: A code specifying a charge currency for this logistics service charge.
domain includes: Service Charge
range includes: currency-code-list
term status: proposed

charge paying party role code
type: ObjectProperty
comment: added from BSP (default-keep re-triage)
definition: The code specifying the role of the party responsible for paying this logistics service charge.
domain includes: Service Charge
range includes: charge-paying-party-role-code-list
term status: proposed

disbursement amount
type: ObjectProperty
comment: added from BSP (per-class property assessment)
definition: A monetary value of a disbursement for this logistics service charge.
domain includes: Service Charge
range includes: MonetaryAmount
term status: proposed

freight charge tariff class code
type: ObjectProperty
comment: added from BSP (default-keep re-triage)
definition: The code specifying the tariff class for this logistics service charge which represents an entry in a table of fixed charges [Reference United Nations Code List (UNCL) 5243].
domain includes: Service Charge
range includes: freight-charge-tariff-class-code-list
term status: proposed

freight invoice type code
type: ObjectProperty
comment: added from BSP (per-class property assessment)
definition: A code specifying a type of freight invoice of this logistics service charge.
domain includes: Service Charge
range includes: any-code
term status: proposed

information type code
type: ObjectProperty
comment: added from BSP (per-class property assessment)
definition: A code specifying an information type of this logistics service charge.
domain includes: Service Charge
range includes: any-code
term status: proposed

invoice type code
type: ObjectProperty
comment: added from BSP (per-class property assessment)
definition: A code specifying a type of invoice of this logistics service charge.
domain includes: Service Charge
range includes: any-code
term status: proposed

logistics service charge transport payment method code
type: ObjectProperty
comment: added from BSP (per-class property assessment)
definition: The code specifying the transport payment method for this logistics service charge.
domain includes: Service Charge
range includes: any-code
term status: proposed

payment place location
type: ObjectProperty
comment: added from BSP (per-class property assessment)
definition: The location of the place of payment of this logistics service charge.
domain includes: Service Charge
range includes: Location
term status: proposed

repackage applied amount
type: ObjectProperty
comment: added from BSP (per-class property assessment)
definition: The monetary value of the repackage on which the logistics service charge is determined.
domain includes: Service Charge
range includes: MonetaryAmount
term status: proposed

service category code
type: ObjectProperty
comment: added from BSP (per-class property assessment)
definition: The code specifying the category of service for this logistics service charge.
domain includes: Service Charge
range includes: any-code
term status: proposed

service type code
type: ObjectProperty
comment: added from BSP (per-class property assessment)
definition: A code specifying a service type of this logistics service charge.
domain includes: Service Charge
range includes: any-code
term status: proposed

specified payment means
type: ObjectProperty
comment: added from BSP (per-class property assessment)
definition: A payment means specified for this header trade settlement.
domain includes: Service Charge
range includes: PaymentMeans
term status: proposed

tariff currency code
type: ObjectProperty
comment: added from BSP (per-class property assessment)
definition: A code specifying a tariff currency for this logistics service charge.
domain includes: Service Charge
range includes: currency-code-list
term status: proposed

transport service category code
type: ObjectProperty
comment: added from BSP (default-keep re-triage)
definition: The code specifying the category of this logistics service charge [Reference United Nations Code List (UNCL) 5237].
domain includes: Service Charge
range includes: transport-service-category-code-list
term status: proposed

Service Charge
type: Class
comment: added from BSP (default-keep re-triage)
definition: A charge made for a logistics related service.
object nature: value
term status: proposed