measured value
type: ObjectProperty
domain includes: Performance
domain includes: Sensor Data
range includes: Measure
definition: The measured value of a performance or sensor reading.
term status: proposed

metric
type: ObjectProperty
domain includes: Performance
domain includes: Sensor Data
range includes: performance-metrics
definition: The performance metric the value is reported against; a code from the performance-metrics taxonomy.
term status: proposed

raw data
type: ObjectProperty
domain includes: Sensor Data
range includes: Link
definition: A link to the raw sensor data.
term status: proposed

sensor
type: ObjectProperty
domain includes: Sensor Data
range includes: Product
definition: The product/device acting as the sensor.
term status: proposed

geo location
type: ObjectProperty
domain includes: Sensor Data
range includes: Coordinate
definition: The geographic coordinate of the sensor reading.
term status: proposed

Sensor Data
type: Class
definition: A sensor data recording associated with a lifecycle event.
object nature: value
term status: proposed