code
type: DatatypeProperty
comment: Also the code qualifier on classification / conformity-topic join nodes.
definition: The code value within a classification scheme.
domain includes: Score
range includes: string
term status: proposed

definition
type: DatatypeProperty
definition: The definition of a classification code.
domain includes: Score
range includes: string
term status: proposed

rank
type: DatatypeProperty
definition: The ordinal rank of the score within its framework.
domain includes: Score
range includes: integer
term status: proposed

Score
type: Class
definition: A single score (code, definition, rank) within a scoring framework.
object nature: value
term status: proposed