production mode code
type: ObjectProperty
comment: added from BSP (per-class property assessment)
domain includes: Product Batch
range includes: any-code
definition: The code specifying the production mode for this product batch.
term status: proposed

specified process
type: ObjectProperty
comment: added from BSP (default-keep re-triage)
domain includes: Product Batch
range includes: ProductionProcess
definition: A production process specified for this product batch.
term status: proposed

component material
type: ObjectProperty
comment: added from BSP (default-keep re-triage)
domain includes: Product Batch
range includes: Material
definition: A material component of this trade product.
term status: proposed

status code
type: ObjectProperty
comment: added from BSP (per-class property assessment)
domain includes: Product Batch
range includes: status-code-list
definition: A code specifying a status for this trade product.
term status: proposed

global id
type: ObjectProperty
comment: added from BSP (per-class property assessment)
domain includes: Product Batch
range includes: Identifier
definition: A global identifier for this supply chain consignment item.
term status: proposed

seller assigned id
type: ObjectProperty
comment: added from BSP (per-class property assessment)
domain includes: Product Batch
range includes: Identifier
definition: A seller assigned identifier of this product batch.
term status: proposed

component batch
type: ObjectProperty
comment: added from BSP (per-class property assessment)
domain includes: Product Batch
range includes: Product Batch
definition: A product batch component of this product batch.
term status: proposed

manufacturer assigned id
type: ObjectProperty
comment: added from BSP (per-class property assessment)
domain includes: Product Batch
range includes: Identifier
definition: A manufacturer assigned identifier of this product batch.
term status: proposed

description code
type: ObjectProperty
comment: added from BSP (per-class property assessment)
domain includes: Product Batch
range includes: any-code
definition: A code specifying a description of this technical characteristic.
term status: proposed

specified picture
type: ObjectProperty
comment: added from BSP (default-keep re-triage)
domain includes: Product Batch
range includes: Image
definition: A photographic picture specified for this product batch.
term status: proposed

creation date time
type: DatatypeProperty
comment: added from BSP (per-class property assessment)
domain includes: Product Batch
range includes: dateTime
definition: The creation date, time, date time, or other date time value for this payment trade settlement.
term status: proposed

name
type: DatatypeProperty
domain includes: Identifier
range includes: string
definition: The name of an item.
term status: proposed

identifier
type: ObjectProperty
range includes: Identifier
definition: An identifier of this entity within some scheme, as an Identifier value object; an entity may bear several (e.g. a GTIN and an internal SKU). Its own resolvable identity is the node URI (@id).
term status: proposed

buyer assigned id
type: ObjectProperty
comment: added from BSP (per-class property assessment)
domain includes: Product Batch
range includes: Identifier
definition: A buyer assigned identifier of this product batch.
term status: proposed

specified location
type: ObjectProperty
comment: added from BSP (per-class property assessment)
domain includes: Product Batch
range includes: Location
definition: A referenced location specified for this material.
term status: proposed

d namarker id
type: ObjectProperty
comment: added from BSP (per-class property assessment)
domain includes: Product Batch
range includes: Identifier
definition: The DNA marker identifier of this product batch.
term status: proposed

Product Batch
type: Class
comment: added from BSP (default-keep re-triage)
definition: A group of products considered or dealt with together.
object nature: entity
term status: proposed

net weight measure
type: ObjectProperty
comment: brought back from BSP (UNVTD grounding gap)
domain includes: Product Batch
range includes: Measure
definition: A measure of the net weight (mass) of this trade product.
term status: proposed

component product
type: ObjectProperty
comment: added from BSP (per-class property assessment)
domain includes: Product Batch
range includes: Product
definition: A trade product component of this product batch.
term status: proposed

description
type: DatatypeProperty
range includes: string
definition: A textual description of an item.
term status: proposed

applied treatment
type: DatatypeProperty
comment: added from BSP (per-class property assessment)
domain includes: Product Batch
range includes: string
definition: A treatment, expressed as text, applied to this crop produce batch.
term status: proposed

product name
type: DatatypeProperty
comment: added from BSP (per-class property assessment)
domain includes: Product Batch
range includes: string
definition: The product name, expressed as text, for this crop produce batch.
term status: proposed