score
type: ObjectProperty
domain includes: Performance
domain includes: ScoringFramework
range includes: Score
definition: A score achieved or defined within a scoring framework.
term status: proposed

Performance
type: Class
definition: A claimed, assessed or required performance level, defined by a measure and/or a score against a metric.
object nature: value
term status: proposed

measured value
type: ObjectProperty
domain includes: Performance
domain includes: SensorData
range includes: Measure
definition: The measured value of a performance or sensor reading.
term status: proposed

metric
type: ObjectProperty
domain includes: Performance
domain includes: SensorData
range includes: performance-metrics
definition: The performance metric the value is reported against; a code from the performance-metrics taxonomy.
term status: proposed