content amount
type: ObjectProperty
comment: added from BSP (per-class property assessment)
definition: Content, expressed as a monetary amount, for this packaging marking.
domain includes: Marking
range includes: MonetaryAmount
term status: proposed

content code
type: ObjectProperty
comment: added from BSP (per-class property assessment)
definition: A code specifying the content of this note.
domain includes: Marking
range includes: any-code
term status: proposed

content date time
type: DatatypeProperty
comment: added from BSP (per-class property assessment)
definition: The date, time, date time or other date time value for the content of this packaging marking.
domain includes: Marking
range includes: dateTime
term status: proposed

packaging marking barcode type code
type: ObjectProperty
comment: added from BSP (per-class property assessment)
definition: A code specifying a type of barcode for this packaging marking.
domain includes: Marking
range includes: any-code
term status: proposed

packaging marking type code
type: ObjectProperty
comment: added from BSP (default-keep re-triage)
definition: A code specifying a type of packaging marking.
domain includes: Marking
range includes: packaging-marking-code-list
term status: proposed

Marking
type: Class
comment: added from BSP (default-keep re-triage)
definition: An inscription, stamp or label on packaging, such as to indicate date, ownership, quality, manufacture or origin.
object nature: value
term status: proposed