output product
type: ObjectProperty
domain includes: Make Event
range includes: Product
definition: A product produced by the make event.
term status: proposed

Make Event
type: Class
subclass of: LifecycleEvent
definition: Transformation (manufacture/production) of input products into output products.
object nature: entity
term status: proposed

made at facility
type: ObjectProperty
domain includes: Make Event
range includes: Facility
definition: The facility where the make event occurs.
term status: proposed

description
type: DatatypeProperty
range includes: string
definition: A textual description of an item.
term status: proposed

input product
type: ObjectProperty
domain includes: Make Event
range includes: Product
range includes: Material
definition: A product/material consumed by the make event.
term status: proposed

name
type: DatatypeProperty
domain includes: Identifier
range includes: string
definition: The name of an item.
term status: proposed

identifier
type: ObjectProperty
range includes: Identifier
definition: An identifier of this entity within some scheme, as an Identifier value object; an entity may bear several (e.g. a GTIN and an internal SKU). Its own resolvable identity is the node URI (@id).
term status: proposed