Forecast Terms
type: Class
comment: added from BSP (default-keep re-triage)
definition: A set of terms and conditions by which a supply chain forecast has been or will be made.
object nature: value
term status: proposed

supply chain forecast terms commitment level code
type: ObjectProperty
comment: added from BSP (default-keep re-triage)
domain includes: Forecast Terms
range includes: commitment-level-code-list
definition: A code specifying a commitment level in these supply chain forecast terms.
term status: proposed