limited quantity code
type: ObjectProperty
comment: added from BSP (per-class property assessment)
domain includes: Dangerous Goods
range includes: any-code
definition: A code specifying facilitations for transport of limited quantities of these transported dangerous goods.
term status: proposed

viscosity measure
type: ObjectProperty
comment: added from BSP (per-class property assessment)
domain includes: Dangerous Goods
range includes: Measure
definition: A viscosity measure for these transported dangerous goods.
term status: proposed

upper part orange hazard placard id
type: ObjectProperty
comment: added from BSP (per-class property assessment)
domain includes: Dangerous Goods
range includes: any-code
definition: The unique upper part of the orange hazard placard identifier for these transported dangerous goods.
term status: proposed

q value numeric
type: DatatypeProperty
comment: added from BSP (per-class property assessment)
domain includes: Dangerous Goods
range includes: decimal
definition: The number of the Q-Value for these transported dangerous goods.
term status: proposed

transport expert contact
type: ObjectProperty
comment: added from BSP (per-class property assessment)
domain includes: Dangerous Goods
range includes: Party
definition: The expert to be contacted for details about the transport of these dangerous goods.
term status: proposed

transport dangerous goods package type code
type: ObjectProperty
comment: added from BSP (per-class property assessment)
domain includes: Dangerous Goods
range includes: package-type-code-list
definition: The code specifying the package type for the transported dangerous goods.
term status: proposed

dangerous goods packaging level packaging danger level code
type: ObjectProperty
comment: added from BSP (default-keep re-triage)
domain includes: Dangerous Goods
range includes: dangerous-goods-packaging-level-code-list
definition: The code specifying the level of danger that the packaging of these dangerous goods must cover for transport purposes.
term status: proposed

density measure
type: ObjectProperty
comment: added from BSP (per-class property assessment)
domain includes: Dangerous Goods
range includes: Measure
definition: A density measure for these transported dangerous goods.
term status: proposed

hazard class version id
type: ObjectProperty
comment: added from BSP (per-class property assessment)
domain includes: Dangerous Goods
range includes: any-code
definition: The unique identifier of the version of a hazard class for these transported dangerous goods.
term status: proposed

e msid
type: ObjectProperty
comment: added from BSP (per-class property assessment)
domain includes: Dangerous Goods
range includes: any-code
definition: The unique transport emergency procedure (EMS) identifier applicable for these transported dangerous goods.
term status: proposed

i mdgsegregation group code
type: ObjectProperty
comment: added from BSP (per-class property assessment)
domain includes: Dangerous Goods
range includes: any-code
definition: The code specifying the IMDG (International Maritime Dangerous Goods regulation) segregation group for these transported dangerous goods.
term status: proposed

explosive compatibility group code
type: ObjectProperty
comment: added from BSP (per-class property assessment)
domain includes: Dangerous Goods
range includes: any-code
definition: The code specifying the explosive compatibility group for these transported dangerous goods.
term status: proposed

maritime pollutant type code
type: ObjectProperty
comment: added from BSP (per-class property assessment)
domain includes: Dangerous Goods
range includes: any-code
definition: A code specifying a type of maritime pollutant for the transported dangerous goods.
term status: proposed

m fagid
type: ObjectProperty
comment: added from BSP (per-class property assessment)
domain includes: Dangerous Goods
range includes: any-code
definition: The unique Medical First Aid Guide (MFAG) identifier for these transported dangerous goods.
term status: proposed

hazard classification id
type: ObjectProperty
comment: added from BSP (per-class property assessment)
domain includes: Dangerous Goods
range includes: dangerous-goods-class-code-list
definition: The unique identifier of a hazard class applicable to these transported dangerous goods as defined by the relevant governing regulation authority.
term status: proposed

handling instructions
type: DatatypeProperty
comment: brought back from BSP; attached to existing class (BSP home dissolved/niche)
domain includes: Consignment
domain includes: Dangerous Goods
range includes: string
definition: Handling instructions for the transported dangerous goods.
term status: proposed

radioactive indicator
type: DatatypeProperty
comment: added from BSP (per-class property assessment)
domain includes: Dangerous Goods
range includes: string
definition: The indicator of whether or not these transported dangerous goods are radioactive.
term status: proposed

dangerous goods regulation code
type: ObjectProperty
comment: added from BSP (default-keep re-triage)
domain includes: Dangerous Goods
range includes: dangerous-goods-regulation-code-list
definition: The code specifying a regulation applicable to these transported dangerous goods.
term status: proposed

proper shipping name
type: DatatypeProperty
comment: added from BSP (per-class property assessment)
domain includes: Dangerous Goods
range includes: string
definition: The proper shipping name, expressed as text, for these transported dangerous goods.
term status: proposed

u ndgidentification code
type: ObjectProperty
comment: added from BSP (per-class property assessment)
domain includes: Dangerous Goods
range includes: un-dangerous-goods-number
definition: The code specifying the unique United Nations Dangerous Goods (UNDG) number assigned to these transported dangerous goods.
term status: proposed

additional hazard classification id
type: ObjectProperty
comment: added from BSP (per-class property assessment)
domain includes: Dangerous Goods
range includes: dangerous-goods-class-code-list
definition: The unique identifier of an additional hazard class applicable to these transported dangerous goods.
term status: proposed

pollutant level code
type: ObjectProperty
comment: added from BSP (per-class property assessment)
domain includes: Dangerous Goods
range includes: any-code
definition: The code specifying the level of pollution of these transported dangerous goods.
term status: proposed

special provision id
type: ObjectProperty
comment: added from BSP (per-class property assessment)
domain includes: Dangerous Goods
range includes: any-code
definition: The unique identifier of the special provision for these transported dangerous goods.
term status: proposed

technical name
type: DatatypeProperty
comment: added from BSP (per-class property assessment)
domain includes: Dangerous Goods
range includes: string
definition: A technical name, expressed as text, for these transported dangerous goods.
term status: proposed

regulatory authority name
type: DatatypeProperty
comment: added from BSP (per-class property assessment)
domain includes: Dangerous Goods
range includes: string
definition: The name, expressed as text, for the regulatory authority for these transported dangerous goods.
term status: proposed

Dangerous Goods
type: Class
comment: added from BSP (default-keep re-triage)
definition: Goods which may contain a substance which poses risks to people and/or the environment during transportation which is regulated by dangerous goods regulations.
object nature: value
term status: proposed

tunnel restriction code
type: ObjectProperty
comment: added from BSP (per-class property assessment)
domain includes: Dangerous Goods
range includes: any-code
definition: The code specifying the tunnel restriction for these transported dangerous goods.
term status: proposed

hazard category code
type: ObjectProperty
comment: added from BSP (per-class property assessment)
domain includes: Dangerous Goods
range includes: any-code
definition: The code specifying the hazard category for these transported dangerous goods.
term status: proposed

marking
type: DatatypeProperty
comment: added from BSP (per-class property assessment)
domain includes: Dangerous Goods
range includes: string
definition: Marking, expressed as text, for these logistics shipping marks.
term status: proposed

flashpoint temperature
type: ObjectProperty
provenance: Proposed Vocab addition — not from BSP/UNTP; pending governance approval.
domain includes: Dangerous Goods
range includes: Measure
definition: The flashpoint temperature of the dangerous goods.
term status: proposed

hazard type code
type: ObjectProperty
comment: added from BSP (per-class property assessment)
domain includes: Dangerous Goods
range includes: any-code
definition: A code specifying the type of hazard for these transported dangerous goods.
term status: proposed

regulation name
type: DatatypeProperty
comment: added from BSP (per-class property assessment)
domain includes: Dangerous Goods
range includes: string
definition: A name, expressed as text, for a regulation of these transported dangerous goods.
term status: proposed

marine pollutant indicator
type: DatatypeProperty
comment: added from BSP (per-class property assessment)
domain includes: Dangerous Goods
range includes: string
definition: The indication of whether or not these transported dangerous goods have a marine pollutant content.
term status: proposed

t remid
type: ObjectProperty
comment: added from BSP (per-class property assessment)
domain includes: Dangerous Goods
range includes: any-code
definition: The unique TRansport EMergency (TREM) card identifier for these transported dangerous goods.
term status: proposed

packing instruction type code
type: ObjectProperty
comment: added from BSP (per-class property assessment)
domain includes: Dangerous Goods
range includes: any-code
definition: The code specifying a type of packing instruction for these transported dangerous goods.
term status: proposed

pollutant indicator
type: DatatypeProperty
comment: added from BSP (per-class property assessment)
domain includes: Dangerous Goods
range includes: string
definition: The indication of whether or not these transported dangerous goods have a pollutant content.
term status: proposed

reportable quantity
type: ObjectProperty
comment: added from BSP (per-class property assessment)
domain includes: Dangerous Goods
range includes: Measure
definition: A reportable quantity for this associated transport equipment.
term status: proposed

emergency contact
type: ObjectProperty
comment: added from BSP (per-class property assessment)
domain includes: Dangerous Goods
range includes: Party
definition: The person or department to be contacted in the event of any emergency related to these transported dangerous goods.
term status: proposed

lower part orange hazard placard id
type: ObjectProperty
comment: added from BSP (per-class property assessment)
domain includes: Dangerous Goods
range includes: any-code
definition: The unique lower part of the orange hazard placard identifier for these transported dangerous goods.
term status: proposed

dangerous goods class code
type: ObjectProperty
provenance: Proposed Vocab addition — not from BSP/UNTP; pending governance approval.
domain includes: Dangerous Goods
range includes: dangerous-goods-class-code-list
definition: The UN hazard class/division of the dangerous goods.
term status: proposed