additional street name
type: DatatypeProperty
comment: restored from BSP (default-keep re-triage)
definition: The additional name of a street, expressed as text, for this trade address.
domain includes: Address
range includes: string
term status: proposed

country
type: ObjectProperty
definition: The country of an address, as an ISO 3166-1 code.
domain includes: Address
range includes: country-id
term status: proposed

locality
type: DatatypeProperty
definition: The locality (city or town) of an address.
domain includes: Address
range includes: string
term status: proposed

region
type: DatatypeProperty
definition: The region (state, province or country subdivision) of an address.
domain includes: Address
range includes: string
term status: proposed

address type code
type: ObjectProperty
comment: added from BSP (default-keep re-triage)
definition: A code specifying the type of this trade address, such as business address or home address.
domain includes: Address
range includes: address-type-code-list
term status: proposed

attention of
type: DatatypeProperty
comment: restored from BSP (default-keep re-triage)
definition: The name, expressed as text, of a person or department in the organization to whom incoming mail is marked with words such as 'for the attention of' or 'FAO' or 'ATTN' for this trade address.
domain includes: Address
range includes: string
term status: proposed

building name
type: DatatypeProperty
definition: The building name of an address.
domain includes: Address
range includes: string
term status: proposed

building number
type: DatatypeProperty
comment: restored from BSP (default-keep re-triage)
definition: The building number, expressed as text, in this trade address.
domain includes: Address
range includes: string
term status: proposed

care of
type: DatatypeProperty
comment: restored from BSP (default-keep re-triage)
definition: The name, expressed as text, of a person or organization at this trade address to whom incoming mail is marked with words such as 'care of' or 'C/O'.
domain includes: Address
range includes: string
term status: proposed

city sub division name
type: DatatypeProperty
comment: restored from BSP (default-keep re-triage)
definition: A name, expressed as text, of a sub-division of a city for this trade address, for example a district or borough.
domain includes: Address
range includes: string
term status: proposed

department name
type: DatatypeProperty
comment: restored from BSP (default-keep re-triage)
definition: A name, expressed as text, of the department to which this trade contact belongs within an organization.
domain includes: Address
range includes: string
term status: proposed

free form
type: DatatypeProperty
comment: restored from BSP (default-keep re-triage)
definition: A free form representation, expressed as text, of this trade address.
domain includes: Address
range includes: string
term status: proposed

geo coordinate identification geographical coordinate
type: ObjectProperty
comment: added from BSP (default-keep re-triage)
definition: An identification of a set of geographical coordinates for this trade address.
domain includes: Address
range includes: Coordinate
term status: proposed

line five
type: DatatypeProperty
comment: restored from BSP (default-keep re-triage)
definition: The fifth free form line, expressed as text, of this financial institution address.
domain includes: Address
range includes: string
term status: proposed

line four
type: DatatypeProperty
comment: restored from BSP (default-keep re-triage)
definition: The fourth free form line, expressed as text, of this financial institution address.
domain includes: Address
range includes: string
term status: proposed

line one
type: DatatypeProperty
comment: restored from BSP (default-keep re-triage)
definition: The first free form line, expressed as text, of this financial institution address.
domain includes: Address
range includes: string
term status: proposed

line three
type: DatatypeProperty
comment: restored from BSP (default-keep re-triage)
definition: The third free form line, expressed as text, of this financial institution address.
domain includes: Address
range includes: string
term status: proposed

line two
type: DatatypeProperty
comment: restored from BSP (default-keep re-triage)
definition: The second free form line, expressed as text, of this financial institution address.
domain includes: Address
range includes: string
term status: proposed

post office box number
type: DatatypeProperty
definition: The post office box number of an address.
domain includes: Address
range includes: string
term status: proposed

postal code
type: DatatypeProperty
definition: The postal code of an address.
domain includes: Address
range includes: string
term status: proposed

street address
type: DatatypeProperty
definition: The street name and number of an address.
domain includes: Address
range includes: string
term status: proposed

Address
type: Class
definition: A postal/physical address of a party or location.
object nature: value
term status: proposed